Target
Protein Nef
Ligand
BDBM288109
Substrate
Meas. Tech.
Measurement of Antiviral (HIV-1) Activity
Temperature
298.15±n/a K
EC50
1.50±n/a nM
Comments
extracted
Citation
 Miyazaki, SIsoshima, HOshita, KKawashita, SNagahashi, NTerashita, M Substituted spiropyrido[1,2-a]pyrazine derivative and medicinal use thereof as HIV integrase inhibitor US Patent  US10087178 Publication Date 10/2/2018 
Target
Name:
Protein Nef
Synonyms:
3ORF HIV-1 Nef Negative factor nef
Type:
C-terminal core protein
Mol. Mass.:
23340.47
Organism:
Human immunodeficiency virus type 1 (isolate BRU/LAI group M subtype B)
Description:
P03406
Residue:
206
  
Inhibitor
Name:
BDBM288109
Synonyms:
Production of N-(3-chloro-2-fluorobenzyl)-9′-hydroxy-trans-3-(methoxymethyl)-2′-methyl-1′,8′-dioxo-1′,2′,3′,8′-tetrahydrospiro[cyclobutane-1,4′-pyrido[1,2-a]pyrazine]-7′-carboxamide | US10087178, Example 27
Type:
Small organic molecule
Emp. Form.:
C29H29ClFN3O5
Mol. Mass.:
554.009
SMILES:
COC[C@H]1C[C@]2(C1)CN(C)C(=O)c1c(OCc3ccccc3)c(=O)c(cn21)C(=O)NCc1cccc(Cl)c1F
: