Target
Aldehyde oxidase 1
Ligand
BDBM175350
Substrate
Meas. Tech.
AO Enzyme Assay
pH
7±n/a
Ki
7.21e+4± 3.7e+4 nM
IC50
6.57e+4±n/a nM
Comments
extracted
Citation
 Siah, MFarzaei, MHAshrafi-Kooshk, MRAdibi, HArab, SSRashidi, MRKhodarahmi, R Inhibition of guinea pig aldehyde oxidase activity by different flavonoid compounds: An in vitro study. Bioorg Chem 64:74-84 (2016)  
Target
Name:
Aldehyde oxidase 1
Synonyms:
AO AOXA_CAVPO Aldehyde: O2 oxidoreductase
Type:
Protein
Mol. Mass.:
145280.02
Organism:
Cavia porcellus (Guinea pig)
Description:
H9TB17
Residue:
1332
  
Inhibitor
Name:
BDBM175350
Synonyms:
2',3',4'-three-Hydroxyl Benzofuranone (2',3',4'-(OH)3) | 6-Hydroxy-2-(2',3',4'-trihydroxybenzylidene)benzofuran-3(2H)-one
Type:
Small organic molecule
Emp. Form.:
C15H10O6
Mol. Mass.:
286.2363
SMILES:
Oc1ccc2C(=O)\C(Oc2c1)=C\c1ccc(O)c(O)c1O
: