Target
Plasminogen activator inhibitor 1
Ligand
BDBM92484
Substrate
Meas. Tech.
Fluorometric Plate Assay
pH
7.8±n/a
Temperature
296.15±n/a K
IC50
2960±n/a nM
Comments
extracted
Citation
 Lawrence, DAEmal, CCale, JSu, EJWarnock, MLi, SCupp, JA Plasminogen activator inhibitor-1 inhibitors and methods of use thereof to modulate lipid metabolism US Patent  US9120744 Publication Date 9/1/2015 
Target
Name:
Plasminogen activator inhibitor 1
Synonyms:
Endothelial plasminogen activator inhibitor PAI-1 PAI1_HUMAN Plasminogen activator inhibitor 1 Plasminogen activator inhibitor-1 SERPINE1
Type:
Enzyme
Mol. Mass.:
45064.00
Organism:
Homo sapiens (Human)
Description:
P05121
Residue:
402
  
Inhibitor
Name:
BDBM92484
Synonyms:
CDE-056 | US9120744, CDE-056
Type:
Small organic molecule
Emp. Form.:
C20H14O10
Mol. Mass.:
414.3192
SMILES:
Oc1cc(cc(O)c1O)C(=O)Oc1ccccc1OC(=O)c1cc(O)c(O)c(O)c1
: