Target
Neuraminidase
Ligand
BDBM5268
Substrate
BDBM4702
Meas. Tech.
Neuraminidase Inhibition Assay
pH
6.5±n/a
Temperature
310.15±n/a K
IC50
25000±n/a nM
Citation
 Atigadda, VRBrouillette, WJDuarte, FBabu, YSBantia, SChand, PChu, NMontgomery, JAWalsh, DASudbeck, EFinley, JAir, GMLuo, MLaver, GW Hydrophobic benzoic acids as inhibitors of influenza neuraminidase. Bioorg Med Chem 7:2487-97 (1999)  
Target
Name:
Neuraminidase
Synonyms:
Influenza A Virus Neuraminidase NRAM_I75A5 | Neuraminidase A
Type:
Enzyme
Mol. Mass.:
52468.81
Organism:
Influenza A virus (N9)
Description:
P03472
Residue:
470
  
Inhibitor
Name:
BDBM5268
Synonyms:
4-(N- Acetylamino) -3 - [N- (3 - pentyl)amino]benzoic acid Benzoic Acid Inhibitor 7
Type:
Small organic molecule
Emp. Form.:
C14H20N2O3
Mol. Mass.:
264.3202
SMILES:
CCC(CC)Nc1cc(ccc1NC(C)=O)C(O)=O
:
Substrate
Name:
BDBM4702
Synonyms:
(2R,4S,5R,6R)-5-acetamido-4-hydroxy-2-[(4-methyl-2-oxo-2H-chromen-7-yl)oxy]-6-[(1R,2R)-1,2,3-trihydroxypropyl]oxane-2-carboxylic acid neuraminidase substrate
Type:
Small organic molecule
Emp. Form.:
C21H25NO11
Mol. Mass.:
467.4233
SMILES:
CC(=O)N[C@@H]1[C@@H](O)C[C@](Oc2ccc3c(C)cc(=O)oc3c2)(O[C@H]1[C@H](O)[C@H](O)CO)C(O)=O
: