Target
Sodium channel protein type 9 subunit alpha
Ligand
BDBM176503
Substrate
Meas. Tech.
FLIPR or FLIPRTETRA Sodium Dye with KCl Assay
Temperature
310.15±n/a K
IC50
1560±500 nM
Comments
extracted
Citation
 Kyle, DJNi, CPark, MTafesse, L Pyridine compounds as sodium channel blockers US Patent  US9120752 Publication Date 9/1/2015 
Target
Name:
Sodium channel protein type 9 subunit alpha
Synonyms:
NENA Peripheral sodium channel 1 SCN9A_HUMAN Voltage-gated sodium channel subunit Nav1.7 hNE-Na
Type:
Protein
Mol. Mass.:
226375.97
Organism:
Homo sapiens (Human)
Description:
Q15858
Residue:
1988
  
Inhibitor
Name:
BDBM176503
Synonyms:
US9120752, 43 | US9765029, 43
Type:
Small organic molecule
Emp. Form.:
C22H20FN3O4
Mol. Mass.:
409.4103
SMILES:
CC(O)[C@H](NC(=O)c1cccc(n1)-c1ccc(Oc2ccc(F)cc2)cc1)C(N)=O
: