Target
Focal adhesion kinase 1
Ligand
BDBM176590
Substrate
Meas. Tech.
Alpha Screen Assay
pH
7.4±n/a
IC50
3.6±n/a nM
Comments
extracted
Citation
 Holmes, IPBergman, YLunniss, GENikac, MChol, NHemley, CFWalker, SRFoitzik, RCGaname, DLessene, R Selective FAK inhibitors US Patent  US9120761 Publication Date 9/1/2015 
Target
Name:
Focal adhesion kinase 1
Synonyms:
FAK1_MOUSE Fak Focal adhesion kinase (FAK) Ptk2
Type:
Enzyme
Mol. Mass.:
123537.99
Organism:
Mus musculus (Mouse)
Description:
P34152
Residue:
1052
  
Inhibitor
Name:
BDBM176590
Synonyms:
US9120761, 4
Type:
Small organic molecule
Emp. Form.:
C29H34F3N5O2
Mol. Mass.:
541.6078
SMILES:
CCN1CCC(CC1)c1ccc(Nc2ncc(c(CCc3ccccc3CC(N)=O)n2)C(F)(F)F)c(OC)c1
: