Target
Vascular endothelial growth factor receptor 3 [818-948,1003-1077]
Ligand
BDBM176591
Substrate
Meas. Tech.
Biochemical Assay
pH
7.4±n/a
IC50
5750±n/a nM
Comments
extracted
Citation
 Holmes, IPBergman, YLunniss, GENikac, MChol, NHemley, CFWalker, SRFoitzik, RCGaname, DLessene, R Selective FAK inhibitors US Patent  US9120761 Publication Date 9/1/2015 
Target
Name:
Vascular endothelial growth factor receptor 3 [818-948,1003-1077]
Synonyms:
FLT4 VGFR3_HUMAN | modified VEGFR3 cytoplasmic domain
Type:
Mol. Mass.:
34324.27
Organism:
Homo sapiens (Human)
Description:
P35916[818-948,1003-1077]
Residue:
306
  
Inhibitor
Name:
BDBM176591
Synonyms:
US9120761, 5
Type:
Small organic molecule
Emp. Form.:
C26H28F3N5O2
Mol. Mass.:
499.528
SMILES:
COc1cc(ccc1Nc1ncc(c(CCc2cccc(c2)C(N)=O)n1)C(F)(F)F)C1CCNCC1
: