Target
11-beta-hydroxysteroid dehydrogenase 1
Ligand
BDBM177627
Substrate
Meas. Tech.
Homogeneous Time-Resolved Fluorescence (HTRF) Assay
pH
6±n/a
IC50
244±n/a nM
Comments
extracted
Citation
 Eckhardt, MMartin, HSchuehle, MSick, SYang, BS Aryl-and heteroarylcarbonyl derivatives of hexahydroindenopyridine and octahydrobenzoquinoline US Patent  US9120769 Publication Date 9/1/2015 
Target
Name:
11-beta-hydroxysteroid dehydrogenase 1
Synonyms:
11-DH 11-beta-Hydroxysteroid Dehydrogenase 1 (11-beta-HSD1) 11-beta-hydroxysteroid dehydrogenase 1 (11HSD1) Corticosteroid 11-beta-dehydrogenase isozyme 1 (11-beta-HSD-1) Corticosteroid 11-beta-dehydrogenase isozyme 1 (11beta-HSD1) HSD11 HSD11L | SDR26C1
Type:
Enzyme
Mol. Mass.:
32409.16
Organism:
Homo sapiens (Human)
Description:
P28845
Residue:
292
  
Inhibitor
Name:
BDBM177627
Synonyms:
US9120769, 91 | US9663470, 91
Type:
Small organic molecule
Emp. Form.:
C22H20N4O
Mol. Mass.:
356.4204
SMILES:
O=C(N1CCCC2[C@@H]1CCc1ccc(cc21)C#N)c1ccc2[nH]cnc2c1
: