Target
11-beta-hydroxysteroid dehydrogenase 1
Ligand
BDBM177658
Substrate
Meas. Tech.
Homogeneous Time-Resolved Fluorescence (HTRF) Assay
pH
6±n/a
IC50
367±n/a nM
Comments
extracted
Citation
 Eckhardt, MMartin, HSchuehle, MSick, SYang, BS Aryl-and heteroarylcarbonyl derivatives of hexahydroindenopyridine and octahydrobenzoquinoline US Patent  US9120769 Publication Date 9/1/2015 
Target
Name:
11-beta-hydroxysteroid dehydrogenase 1
Synonyms:
11-DH 11-beta-Hydroxysteroid Dehydrogenase 1 (11-beta-HSD1) 11-beta-hydroxysteroid dehydrogenase 1 (11HSD1) Corticosteroid 11-beta-dehydrogenase isozyme 1 (11-beta-HSD-1) Corticosteroid 11-beta-dehydrogenase isozyme 1 (11beta-HSD1) HSD11 HSD11L | SDR26C1
Type:
Enzyme
Mol. Mass.:
32409.16
Organism:
Homo sapiens (Human)
Description:
P28845
Residue:
292
  
Inhibitor
Name:
BDBM177658
Synonyms:
US9120769, 160 | US9663470, 160
Type:
Small organic molecule
Emp. Form.:
C24H21N3O2
Mol. Mass.:
383.4424
SMILES:
O=C(N1CCC[C@H]2[C@@H]1Cc1ccc(cc21)-c1ccoc1)c1ccc2[nH]cnc2c1
: