Target
Protein O-GlcNAcase
Ligand
BDBM177758
Substrate
Meas. Tech.
Enzyme Assay
pH
7±n/a
Temperature
298.15±n/a K
Ki
0.2±n/a nM
Comments
extracted
Citation
 Li, TMceachern, EJVocadlo, DJZhou, YZhu, YLiu, KSelnick, HG Selective glycosidase inhibitors and uses thereof US Patent  US9120781 Publication Date 9/1/2015 
Target
Name:
Protein O-GlcNAcase
Synonyms:
2-acetamido-2-deoxy-β-D-glucopyranosidase (O-GlcNAcase) Beta-hexosaminidase (O-GlcNAcase) HEXC MEA5 N-acetyl-beta-D-glucosaminidase (O-GlcNAcase) OGA Protein O-GlcNAcase
Type:
Enzyme
Mol. Mass.:
102874.67
Organism:
Homo sapiens (Human)
Description:
O60502
Residue:
916
  
Inhibitor
Name:
BDBM177758
Synonyms:
US9120781, 26
Type:
Small organic molecule
Emp. Form.:
C9H16N2O3S
Mol. Mass.:
232.3
SMILES:
CNC1=N[C@H]2[C@H](C[C@H](CO)[C@@H](O)[C@@H]2O)S1
: