Target
Tyrosine-protein kinase SYK
Ligand
BDBM177767
Substrate
Meas. Tech.
Homogeneous Time-Resolved Fluorescence (HTRF) Assay
pH
7.5±n/a
Temperature
298.15±n/a K
IC50
0.5±n/a nM
Comments
extracted
Citation
 Altman, MDDi Francesco, MEHaidle, AMOtte, RDEllis, JMChilders, KKNorthrup, ABWang, L Pyridyl aminopyridines as Syk inhibitors US Patent  US9120785 Publication Date 9/1/2015 
Target
Name:
Tyrosine-protein kinase SYK
Synonyms:
KSYK_HUMAN Spleen Tyrosine Kinase Tyrosine-protein kinase SYK (Syk)
Type:
Enzyme
Mol. Mass.:
72079.99
Organism:
Homo sapiens (Human)
Description:
P43405
Residue:
635
  
Inhibitor
Name:
BDBM177767
Synonyms:
US9120785, Example 14-4
Type:
Small organic molecule
Emp. Form.:
C24H26F2N4O3S
Mol. Mass.:
488.55
SMILES:
Cc1cc(Nc2cc(ccn2)C(F)F)nc(c1)-c1cnc(s1)C(C)(O)C1CCC(CC1)C(O)=O
: