Target
Adenosine receptor A2b
Ligand
BDBM50310923
Substrate
Meas. Tech.
Fluorometric Imaging Plate Reader (FLIPR) Asssay
IC50
1.4±n/a nM
Citation
 Jordan, ABedford, SBurkhard, KYule, IPoullennec, K Thienopyrimidine compounds US Patent  US9120807 Publication Date 9/1/2015 
Target
Name:
Adenosine receptor A2b
Synonyms:
AA2BR_HUMAN ADORA2B Adenosine receptors A2b | Adenosine receptors; A2a & A2b
Type:
G Protein-Coupled Receptor (GPCR)
Mol. Mass.:
36341.22
Organism:
Homo sapiens (Human)
Description:
Residue:
332
  
Inhibitor
Name:
BDBM50310923
Synonyms:
CHEMBL1077943 {6-Methylamino-2-[(pyridin-3-ylmethyl)-amino]-thieno[3,2-d]pyrimidin-4-yl}-thiophen-2-yl-methanone
Type:
Small organic molecule
Emp. Form.:
C18H15N5OS2
Mol. Mass.:
381.475
SMILES:
CNc1cc2nc(NCc3cccnc3)nc(C(=O)c3cccs3)c2s1
: