Target
Adenosine receptor A2b
Ligand
BDBM177998
Substrate
Meas. Tech.
Fluorometric Imaging Plate Reader (FLIPR) Asssay
IC50
52.3±n/a nM
Citation
 Jordan, ABedford, SBurkhard, KYule, IPoullennec, K Thienopyrimidine compounds US Patent  US9120807 Publication Date 9/1/2015 
Target
Name:
Adenosine receptor A2b
Synonyms:
AA2BR_HUMAN ADORA2B Adenosine receptors A2b | Adenosine receptors; A2a & A2b
Type:
G Protein-Coupled Receptor (GPCR)
Mol. Mass.:
36341.22
Organism:
Homo sapiens (Human)
Description:
Residue:
332
  
Inhibitor
Name:
BDBM177998
Synonyms:
US9120807, 10
Type:
Small organic molecule
Emp. Form.:
C19H14N4OS2
Mol. Mass.:
378.471
SMILES:
C=Cc1cc2nc(NCc3cccnc3)nc(C(=O)c3cccs3)c2s1
: