Target
Oligo-1,6-glucosidase IMA1
Ligand
BDBM178001
Substrate
Meas. Tech.
alpha-Glucosidase Inhibition Assay
pH
6.8±n/a
IC50
4.466e+4± 3.4e+2 nM
Comments
extracted
Citation
 Imran, STaha, MIsmail, NHKashif, SMRahim, FJamil, WWahab, HKhan, KM Synthesis, In vitro and Docking Studies of New Flavone Ethers as a-Glucosidase Inhibitors. Chem Biol Drug Des 87:361-73 (2016)  
Target
Name:
Oligo-1,6-glucosidase IMA1
Synonyms:
α-glucosidase Alpha-glucosidase (α-glucosidase) MALX3_YEAST | Oligo-1,6-glucosidase
Type:
Protein
Mol. Mass.:
68577.59
Organism:
Saccharomyces cerevisiae S288c (Baker's yeast)
Description:
Residue:
589
  
Inhibitor
Name:
BDBM178001
Synonyms:
(E)-1-(2-hydroxyphenyl)-3-(3-hydroxyphenyl)prop-2-en-1-one (1) | US11866416, Compound 2
Type:
Small organic molecule
Emp. Form.:
C15H12O3
Mol. Mass.:
240.254
SMILES:
Oc1cccc(\C=C\C(=O)c2ccccc2O)c1
: