Target
Oligo-1,6-glucosidase IMA1
Ligand
BDBM50431165
Substrate
Meas. Tech.
alpha-Glucosidase Inhibition Assay
pH
6.8±n/a
IC50
3.466e+4± 2.8e+2 nM
Comments
extracted
Citation
 Imran, STaha, MIsmail, NHKashif, SMRahim, FJamil, WWahab, HKhan, KM Synthesis, In vitro and Docking Studies of New Flavone Ethers as a-Glucosidase Inhibitors. Chem Biol Drug Des 87:361-73 (2016)  
Target
Name:
Oligo-1,6-glucosidase IMA1
Synonyms:
α-glucosidase Alpha-glucosidase (α-glucosidase) MALX3_YEAST | Oligo-1,6-glucosidase
Type:
Protein
Mol. Mass.:
68577.59
Organism:
Saccharomyces cerevisiae S288c (Baker's yeast)
Description:
Residue:
589
  
Inhibitor
Name:
BDBM50431165
Synonyms:
2-(3-hydroxyphenyl)-4H-chromen-4-one (2) NSC-22356
Type:
Small organic molecule
Emp. Form.:
C15H10O3
Mol. Mass.:
238.2381
SMILES:
Oc1cccc(c1)-c1cc(=O)c2ccccc2o1
: