Target
Oligo-1,6-glucosidase IMA1
Ligand
BDBM178007
Substrate
Meas. Tech.
alpha-Glucosidase Inhibition Assay
pH
6.8±n/a
IC50
8.66e+3± 8e+1 nM
Comments
extracted
Citation
 Imran, STaha, MIsmail, NHKashif, SMRahim, FJamil, WWahab, HKhan, KM Synthesis, In vitro and Docking Studies of New Flavone Ethers as a-Glucosidase Inhibitors. Chem Biol Drug Des 87:361-73 (2016)  
Target
Name:
Oligo-1,6-glucosidase IMA1
Synonyms:
α-glucosidase Alpha-glucosidase (α-glucosidase) MALX3_YEAST | Oligo-1,6-glucosidase
Type:
Protein
Mol. Mass.:
68577.59
Organism:
Saccharomyces cerevisiae S288c (Baker's yeast)
Description:
Residue:
589
  
Inhibitor
Name:
BDBM178007
Synonyms:
2-(3-((3-((trifluoromethyl)thio)benzyl)oxy)phenyl)-4H-chromen-4-one (8)
Type:
Small organic molecule
Emp. Form.:
C23H15F3O3S
Mol. Mass.:
428.424
SMILES:
FC(F)(F)Sc1cccc(COc2cccc(c2)-c2cc(=O)c3ccccc3o2)c1
: