Target
Xanthine dehydrogenase/oxidase
Ligand
BDBM178044
Substrate
Meas. Tech.
Xanthine Oxidase (XO) Assay
pH
7.4±n/a
IC50
6.02e+4± 5.4e+2 nM
Comments
extracted
Citation
 Ali, MRKumar, SAfzal, OShalmali, NSharma, MBawa, S Development of 2-(Substituted Benzylamino)-4-Methyl-1, 3-Thiazole-5-Carboxylic Acid Derivatives as Xanthine Oxidase Inhibitors and Free Radical Scavengers. Chem Biol Drug Des 87:508-16 (2016)  
Target
Name:
Xanthine dehydrogenase/oxidase
Synonyms:
XDH Xanthine dehydrogenase Xanthine oxidase (XO)
Type:
Protein
Mol. Mass.:
146809.00
Organism:
Bos taurus (Bovine)
Description:
P80457
Residue:
1332
  
Inhibitor
Name:
BDBM178044
Synonyms:
2-{[(3,4-dihydroxyphenyl)methyl]amino}-4-methyl-1,3-thiazole-5-carboxylic acid (5p)
Type:
Small organic molecule
Emp. Form.:
C12H12N2O4S
Mol. Mass.:
280.3
SMILES:
Cc1nc(NCc2ccc(O)c(O)c2)sc1C(O)=O
: