Target
Beta-lactamase
Ligand
BDBM178191
Substrate
Meas. Tech.
Cell Free Inhibition Assay
pH
7±n/a
Temperature
310.15±n/a K
IC50
16035±n/a nM
Comments
extracted
Citation
 Bulusu, AR Substituted clavulanic acid US Patent  US9120808 Publication Date 9/1/2015 
Target
Name:
Beta-lactamase
Synonyms:
AMPC_ECOLI Beta-lactamase (AmpC) Cephalosporinase ampA | ampC
Type:
Protien
Mol. Mass.:
41561.62
Organism:
Escherichia coli
Description:
P00811
Residue:
377
  
Inhibitor
Name:
BDBM178191
Synonyms:
US9120808, Example 10
Type:
Small organic molecule
Emp. Form.:
C21H21NO7
Mol. Mass.:
399.3939
SMILES:
CC(=O)OCC=CCC(C=O)=C1O[C@@H]2CC(=O)N2C1C(=O)OCc1ccccc1
: