Target
Beta-lactamase
Ligand
BDBM178196
Substrate
Meas. Tech.
Cell Free Inhibition Assay
pH
7±n/a
Temperature
310.15±n/a K
IC50
941.4±n/a nM
Comments
extracted
Citation
 Bulusu, AR Substituted clavulanic acid US Patent  US9120808 Publication Date 9/1/2015 
Target
Name:
Beta-lactamase
Synonyms:
AMPC_ECOLI Beta-lactamase (AmpC) Cephalosporinase ampA | ampC
Type:
Protien
Mol. Mass.:
41561.62
Organism:
Escherichia coli
Description:
P00811
Residue:
377
  
Inhibitor
Name:
BDBM178196
Synonyms:
US9120808, Example 16
Type:
Small organic molecule
Emp. Form.:
C12H13NO5
Mol. Mass.:
251.2353
SMILES:
COC(=O)C1N2[C@@H](CC2=O)OC1=C(CC=C)C=O
: