Target
Beta-lactamase SHV-1
Ligand
BDBM178196
Substrate
Meas. Tech.
Cell Free Inhibition Assay
pH
7±n/a
Temperature
310.15±n/a K
IC50
80.5±n/a nM
Comments
extracted
Citation
 Bulusu, AR Substituted clavulanic acid US Patent  US9120808 Publication Date 9/1/2015 
Target
Name:
Beta-lactamase SHV-1
Synonyms:
BLA1_ECOLX bla | shv1
Type:
Enzyme
Mol. Mass.:
31226.68
Organism:
Escherichia coli
Description:
P0AD63
Residue:
286
  
Inhibitor
Name:
BDBM178196
Synonyms:
US9120808, Example 16
Type:
Small organic molecule
Emp. Form.:
C12H13NO5
Mol. Mass.:
251.2353
SMILES:
COC(=O)C1N2[C@@H](CC2=O)OC1=C(CC=C)C=O
: