Target
Beta-lactamase TEM
Ligand
BDBM178198
Substrate
Meas. Tech.
Cell Free Inhibition Assay
pH
7±n/a
Temperature
310.15±n/a K
IC50
27.1±n/a nM
Comments
extracted
Citation
 Bulusu, AR Substituted clavulanic acid US Patent  US9120808 Publication Date 9/1/2015 
Target
Name:
Beta-lactamase TEM
Synonyms:
BLAT_ECOLX Beta-lactamase (TEM-1) Beta-lactamase TEM-1 Beta-lactamase TEM1D Beta-lactamase TEM1F TEM extended-spectrum beta-lactamase bla
Type:
Enzyme
Mol. Mass.:
31512.33
Organism:
Escherichia coli
Description:
P62593
Residue:
286
  
Inhibitor
Name:
BDBM178198
Synonyms:
US9120808, Example 18
Type:
Small organic molecule
Emp. Form.:
C23H25NO7
Mol. Mass.:
427.4471
SMILES:
CC(C)(C)C(=O)OCOC(=O)C1N2[C@@H](CC2=O)OC1=C(CC=Cc1ccccc1)C=O
: