Target
Phosphatidylinositol 3-kinase regulatory subunit alpha
Ligand
BDBM178381
Substrate
Meas. Tech.
Enzyme Assay
pH
7.5±n/a
IC50
2300±n/a nM
Comments
extracted
Citation
 Braun, ACrespin, OForicher, YMarciniak, GMuzet, NNicolai, EPascal, CVivet, BViviani, F Pyrimidooxazocine derivatives as mTOR-inhibitors US Patent  US9120812 Publication Date 9/1/2015 
Target
Name:
Phosphatidylinositol 3-kinase regulatory subunit alpha
Synonyms:
GRB1 PI3-kinase class I PI3-kinase p85-alpha subunit PI3-kinase subunit p85-alpha PIK3CG/PIK3R1 Phosphatidylinositol 3-kinase 85 kDa regulatory subunit alpha (PI3K alpha) Phosphatidylinositol 3-kinase regulatory subunit alpha (PIK3R1) Phosphatidylinositol 3-kinase regulatory subunit alpha isoform 1 (PI3 Kinase alpha) Phosphatidylinositol 4,5-bisphosphate 3-kinase catalytic subunit alpha isoform (PI3Kalpha) PtdIns-3-kinase p85-alpha p85 alpha
Type:
Protein
Mol. Mass.:
83592.82
Organism:
Homo sapiens (Human)
Description:
P27986
Residue:
724
  
Inhibitor
Name:
BDBM178381
Synonyms:
US9120812, 166
Type:
Small organic molecule
Emp. Form.:
C27H33FN8O4
Mol. Mass.:
552.6005
SMILES:
CCN1CC(C)(C)Oc2nc(nc(-c3ccc(NC(=O)Nc4ccn(C)n4)c(F)c3)c2C1=O)N1CCOC[C@@H]1C
: