Target
ALK tyrosine kinase receptor
Ligand
BDBM178963
Substrate
Meas. Tech.
Inhibition Assay
IC50
0.84±n/a nM
Citation
 Kinoshita, KAsoh, KFuruichi, NIto, TKawada, HIshii, NSakamoto, HHong, WPark, MOno, YKato, YMorikami, KEmura, TOikawa, N Tetracyclic compound US Patent  US9126931 Publication Date 9/8/2015 
Target
Name:
ALK tyrosine kinase receptor
Synonyms:
ALK ALK_HUMAN CD_antigen: CD246
Type:
Protein
Mol. Mass.:
176453.10
Organism:
Homo sapiens (Human)
Description:
Q9UM73
Residue:
1620
  
Inhibitor
Name:
BDBM178963
Synonyms:
US9126931, 177
Type:
Small organic molecule
Emp. Form.:
C27H29N3O
Mol. Mass.:
411.5387
SMILES:
CC(C)N1CCC(CC1)c1ccc2C(=O)c3c([nH]c4cc(ccc34)C#N)C(C)(C)c2c1
: