Target
ALK tyrosine kinase receptor
Ligand
BDBM178985
Substrate
Meas. Tech.
Inhibition Assay
IC50
0.81±n/a nM
Citation
 Kinoshita, KAsoh, KFuruichi, NIto, TKawada, HIshii, NSakamoto, HHong, WPark, MOno, YKato, YMorikami, KEmura, TOikawa, N Tetracyclic compound US Patent  US9126931 Publication Date 9/8/2015 
Target
Name:
ALK tyrosine kinase receptor
Synonyms:
ALK ALK_HUMAN CD_antigen: CD246
Type:
Protein
Mol. Mass.:
176453.10
Organism:
Homo sapiens (Human)
Description:
Q9UM73
Residue:
1620
  
Inhibitor
Name:
BDBM178985
Synonyms:
US9126931, 304
Type:
Small organic molecule
Emp. Form.:
C27H25N5O2
Mol. Mass.:
451.5197
SMILES:
Cn1cc(cn1)-c1cc2C(=O)c3c([nH]c4cc(ccc34)C#N)C(C)(C)c2cc1N1CCOCC1
: