Target
Androgen receptor
Ligand
BDBM179209
Substrate
Meas. Tech.
Reporter Assay
IC50
311±n/a nM
Citation
 Sawyers, CLJung, MEChen, CDOuk, STran, CWongvipat, J Treatment of hyperproliferative disorders with diarylhydantoin compounds US Patent  US9126941 Publication Date 9/8/2015 
Target
Name:
Androgen receptor
Synonyms:
ANDR_HUMAN Androgen Receptor Androgen receptor/Baculoviral IAP repeat-containing protein 2 Dihydrotestosterone receptor Nuclear receptor subfamily 3 group C member 4
Type:
Receptor
Mol. Mass.:
99185.27
Organism:
Homo sapiens (Human)
Description:
CHO cells were stably transfected with human AR gene.
Residue:
920
  
Inhibitor
Name:
BDBM179209
Synonyms:
US9126941, RD110
Type:
Small organic molecule
Emp. Form.:
C21H16F3N3O2S
Mol. Mass.:
431.431
SMILES:
OCc1ccc(cc1)N1C(=S)N(C(=O)C11CCC1)c1ccc([N+]#[C-])c(c1)C(F)(F)F
: