Target
Phosphatidylinositol 4,5-bisphosphate 3-kinase catalytic subunit delta isoform
Ligand
BDBM179271
Substrate
Meas. Tech.
Scintillation Proximity Assay (SPA)
pH
6.7±n/a
Temperature
298.15±n/a K
IC50
<20±n/a nM
Comments
extracted
Citation
 Combs, APLi, YYue, EWMei, S Pyrimidine-4,6-diamine derivatives as PI3K inhibitors US Patent  US9126948 Publication Date 9/8/2015 
Target
Name:
Phosphatidylinositol 4,5-bisphosphate 3-kinase catalytic subunit delta isoform
Synonyms:
PI3-kinase p110 subunit delta PI3-kinase subunit p110-delta PIK3CD Phosphatidylinositol 4,5-biphosphate 3-kinase catalytic subunit delta (PIK3CD) Phosphatidylinositol 4,5-bisphosphate 3-kinase 110 kDa catalytic subunit delta (PI3K delta) Phosphatidylinositol 4,5-bisphosphate 3-kinase catalytic subunit delta (PI3Kdelta) Phosphatidylinositol 4,5-bisphosphate 3-kinase catalytic subunit delta isoform (PI3K delta) Phosphatidylinositol 4,5-bisphosphate 3-kinase catalytic subunit delta isoform (PI3K-delta) Phosphatidylinositol 4,5-bisphosphate 3-kinase catalytic subunit delta isoform (PI3Kdelta)
Type:
Enzyme Subunit
Mol. Mass.:
119489.41
Organism:
Homo sapiens (Human)
Description:
O00329
Residue:
1044
  
Inhibitor
Name:
BDBM179271
Synonyms:
US9126948, 11
Type:
Small organic molecule
Emp. Form.:
C20H18Cl2N6O3S
Mol. Mass.:
493.366
SMILES:
COc1c(cc(Cl)c(Cl)c1-c1cncc(c1)S(C)(=O)=O)C(C)Nc1ncnc(N)c1C#N
: