Target
Hematopoietic prostaglandin D synthase
Ligand
BDBM179408
Substrate
Meas. Tech.
Enzyme Immunoassay (EIA))
pH
8±n/a
Temperature
298.15±n/a K
IC50
21±n/a nM
Comments
extracted
Citation
 Endres, GWLee, PHOlson, KLKramer, JBCiske, FLBarrett, SD Multiheteroaryl compounds as inhibitors of H-PGDS and their use for treating prostaglandin D2 mediated diseases US Patent  US9126973 Publication Date 9/8/2015 
Target
Name:
Hematopoietic prostaglandin D synthase
Synonyms:
GSTS Glutathione-requiring prostaglandin D synthase HPGDS Hematopoietic prostaglandin D synthase Hematopoietic prostaglandin D synthase (HPGDS) PTGDS2 Prostaglandin D Synthase
Type:
Enzyme
Mol. Mass.:
23341.07
Organism:
Homo sapiens (Human)
Description:
The protein was expressed in E. coli strain BL21(DE3) with an N-terminal 6-His tag.
Residue:
199
  
Inhibitor
Name:
BDBM179408
Synonyms:
US9126973, 10
Type:
Small organic molecule
Emp. Form.:
C18H13N5
Mol. Mass.:
299.3293
SMILES:
c1nc([nH]c1-c1cnc(nc1)-c1ccccc1)-c1cccnc1
: