Target
PC4 and SFRS1-interacting protein
Ligand
BDBM179831
Substrate
Meas. Tech.
Alpha Screen Interaction Assay
pH
7.4±n/a
Temperature
277.15±n/a K
IC50
1080±n/a nM
Comments
extracted
Citation
 Chaltin, PChrist, FDebyser, ZDe Maeyer, MMarchand, AMarchand, DVoet, A Antiviral compounds US Patent  US9132129 Publication Date 9/15/2015 
Target
Name:
PC4 and SFRS1-interacting protein
Synonyms:
DFS70 LEDGF/p75 PSIP1_HUMAN lens epithelium-derived growth factor p75
Type:
Enzyme Catalytic Domain
Mol. Mass.:
60120.68
Organism:
Homo sapiens (Human)
Description:
gi_6708281
Residue:
530
  
Inhibitor
Name:
BDBM179831
Synonyms:
US9132129, Cpd012
Type:
Small organic molecule
Emp. Form.:
C25H27NO2
Mol. Mass.:
373.4874
SMILES:
CCCC(C(O)=O)c1c(C)nc2cc3CCCc3cc2c1-c1ccc(C)cc1
: