Target
Histone deacetylase 4/Myocyte-specific enhancer factor 2D
Ligand
BDBM179872
Substrate
Meas. Tech.
Two-Hybrid Assay
IC50
110±n/a nM
Citation
 Chen, LChen, XWu, YGai, D Transcription factor modulators US Patent  US9133105 Publication Date 9/15/2015 
Target
Name:
Histone deacetylase 4/Myocyte-specific enhancer factor 2D
Synonyms:
HDAC4 and MEF2D Protein | MEF2D/HDAC4
Type:
Protein
Mol. Mass.:
Description:
Components:
This complex has 2 components.
Component 1
Name:
Myocyte-specific enhancer factor 2D
Synonyms:
MEF2D Myocyte-specific enhancer factor 2D (MEF2D)
Type:
Enzyme
Mol. Mass.:
55943.70
Organism:
Homo sapiens (Human)
Description:
Q14814
Residue:
521
  
Component 2
Name:
Histone deacetylase 4
Synonyms:
Cereblon/Histone deacetylase 4 HDAC4 Histone acetylase 4(HDAC4) KIAA0288
Type:
Enzyme
Mol. Mass.:
119049.39
Organism:
Homo sapiens (Human)
Description:
P56524
Residue:
1084
  
Inhibitor
Name:
BDBM179872
Synonyms:
US9133105, CC7
Type:
Small organic molecule
Emp. Form.:
C18H21BrN4O2
Mol. Mass.:
405.289
SMILES:
Nc1ccccc1NC(=O)CCCCCC(=O)Nc1cncc(Br)c1
: