Target
Mu-type opioid receptor
Ligand
BDBM179874
Substrate
Meas. Tech.
pH
7.5±n/a
Temperature
298.15±n/a K
Ki
0.11±n/a nM
IC50
2±0.3 nM
Comments
extracted
Citation
 Blumberg, LCDeaver, DEyerman, D Morphan and morphinan analogues, and methods of use US Patent  US9133125 Publication Date 9/15/2015 
Target
Name:
Mu-type opioid receptor
Synonyms:
M-OR-1 MOR-1 MUOR1 Mu opiate receptor OPRM1 hMOP | mu-type opioid receptor isoform MOR-1
Type:
G Protein-Coupled Receptor (GPCR)
Mol. Mass.:
44789.51
Organism:
Homo sapiens (Human)
Description:
P35372
Residue:
400
  
Inhibitor
Name:
BDBM179874
Synonyms:
US10231963, Table B.18 US10736890, Compound TABLE B.21 US11534436, Compound Table B.18 US9656961, Example 00135
Type:
Small organic molecule
Emp. Form.:
C23H30N2O3
Mol. Mass.:
382.4959
SMILES:
NC(=O)c1ccc2C[C@H]3N(CC4CCC4)CC[C@@]4(CC(=C)CC[C@@]34O)c2c1O
: