Target
Mu-type opioid receptor
Ligand
BDBM179908
Substrate
Meas. Tech.
pH
7.5±n/a
Temperature
298.15±n/a K
Ki
1.3±0.4 nM
IC50
88±18 nM
Comments
extracted
Citation
 Blumberg, LCDeaver, DEyerman, D Morphan and morphinan analogues, and methods of use US Patent  US9133125 Publication Date 9/15/2015 
Target
Name:
Mu-type opioid receptor
Synonyms:
M-OR-1 MOR-1 MUOR1 Mu opiate receptor OPRM1 hMOP | mu-type opioid receptor isoform MOR-1
Type:
G Protein-Coupled Receptor (GPCR)
Mol. Mass.:
44789.51
Organism:
Homo sapiens (Human)
Description:
P35372
Residue:
400
  
Inhibitor
Name:
BDBM179908
Synonyms:
US10736890, Compound TABLE B.1 US11534436, Compound nalbuphine | US9133125, Table D, nalbuphine
Type:
Small organic molecule
Emp. Form.:
C21H27NO4
Mol. Mass.:
357.4434
SMILES:
O[C@H]1CC[C@@]2(O)[C@H]3Cc4ccc(O)c5OC1[C@]2(CCN3CC1CCC1)c45
: