Target
Sodium channel protein type 9 subunit alpha
Ligand
BDBM179910
Substrate
Meas. Tech.
Electrophysiology Assay
Ki
60±10 nM
Citation
 Shao, B Pyrimidine diol amides as sodium channel blockers US Patent  US9133131 Publication Date 9/15/2015 
Target
Name:
Sodium channel protein type 9 subunit alpha
Synonyms:
NENA Peripheral sodium channel 1 SCN9A_HUMAN Voltage-gated sodium channel subunit Nav1.7 hNE-Na
Type:
Protein
Mol. Mass.:
226375.97
Organism:
Homo sapiens (Human)
Description:
Q15858
Residue:
1988
  
Inhibitor
Name:
BDBM179910
Synonyms:
US9133131, 1
Type:
Small organic molecule
Emp. Form.:
C19H16FN3O4
Mol. Mass.:
369.3464
SMILES:
NC(=O)c1cc(nc(n1)-c1ccc(Oc2ccc(F)cc2)cc1)[C@H](O)CO
: