Target
Gag-Pol polyprotein
Ligand
BDBM180151
Substrate
Meas. Tech.
Inhibition Assay
pH
5.5±n/a
Temperature
298.15±n/a K
IC50
2.27±n/a nM
Comments
extracted
Citation
 Boyd, MJChiasson, JCrane, SGiroux, A HIV protease inhibitors US Patent  US9133157 Publication Date 9/15/2015 
Target
Name:
Gag-Pol polyprotein
Synonyms:
HIV-1 reverse transcriptase (HIV-1 RT) POL_HV1H2 Protease Reverse transcriptase (RT) gag-pol p66 RT
Type:
Protein
Mol. Mass.:
162074.74
Organism:
Human immunodeficiency virus type 1 group M subtype B (isolate HXB2)
Description:
P04585
Residue:
1435
  
Inhibitor
Name:
BDBM180151
Synonyms:
US9133157, 32
Type:
Small organic molecule
Emp. Form.:
C35H34N6O6S3
Mol. Mass.:
730.876
SMILES:
COC(=O)N[C@@H](C(c1ccccc1)c1ccccc1)C(=O)NCc1ccc(s1)[C@@H](CO)N(Cc1cn[nH]c1)S(=O)(=O)c1ccc2scnc2c1
: