Target
Steroid 17-alpha-hydroxylase/17,20 lyase
Ligand
BDBM50391846
Substrate
Meas. Tech.
SPA Assay
pH
7.2±n/a
Temperature
277.15±n/a K
IC50
12±n/a nM
Comments
extracted
Citation
 Huang, A Substituted benzimidazole and imidazopyridine compounds useful as CYP17 modulators US Patent  US9133160 Publication Date 9/15/2015 
Target
Name:
Steroid 17-alpha-hydroxylase/17,20 lyase
Synonyms:
CP17A_HUMAN CYP17A1 Cytochrome P450 17A1 Cytochrome P450 C17 (CYP17) Cytochrome P450-C17 P450-C17 Steroid 17-alpha-Monooxygenase (CYP17) Steroid 17-alpha-monooxygenase | cytochrome P450 monooxygenase 17 alpha hydroxylase/17,20-lyase (CYP17)
Type:
Enzyme
Mol. Mass.:
57382.42
Organism:
Homo sapiens (Human)
Description:
E.coli expressing human CYP17
Residue:
508
  
Inhibitor
Name:
BDBM50391846
Synonyms:
CHEMBL2147041 | US9133160, 31
Type:
Small organic molecule
Emp. Form.:
C15H12F3N3
Mol. Mass.:
291.2711
SMILES:
Cc1ccncc1-c1cccc2n(CC(F)(F)F)cnc12
: