Target
Cyclin-dependent kinase 9
Ligand
BDBM180843
Substrate
Meas. Tech.
CDK9/CycT1 Kinase Assay
pH
8±n/a
Temperature
295.15±n/a K
IC50
2±n/a nM
Comments
extracted
Citation
 Lücking, UKosemund, DScholz, ALienau, PSiemeister, GBömer, UBohlmann, R Disubstituted 5-fluoro pyrimidine derivatives containing a sulfoximine group US Patent  US9133171 Publication Date 9/15/2015 
Target
Name:
Cyclin-dependent kinase 9
Synonyms:
C-2K CDK9 Cell division cycle 2-like protein kinase 4 Cyclin-Dependent Kinase 9 (CDK9) Serine/threonine-protein kinase PITALRE Tat-associated kinase complex catalytic subunit
Type:
Enzyme Subunit
Mol. Mass.:
42789.13
Organism:
Homo sapiens (Human)
Description:
Residue:
372
  
Inhibitor
Name:
BDBM180843
Synonyms:
US9133171, 48
Type:
Small organic molecule
Emp. Form.:
C22H19F2N5O2S
Mol. Mass.:
455.48
SMILES:
COc1cc(F)ccc1-c1nc(Nc2cccc(CS(=O)(=NC#N)C3CC3)c2)ncc1F
: