Target
Cyclin-dependent kinase 9
Ligand
BDBM180850
Substrate
Meas. Tech.
CDK9/CycT1
pH
8±n/a
Temperature
295.15±n/a K
IC50
4±n/a nM
Comments
extracted
Citation
 Lücking, UKosemund, DScholz, ALienau, PSiemeister, GBömer, UBohlmann, R Disubstituted 5-fluoro pyrimidine derivatives containing a sulfoximine group US Patent  US9133171 Publication Date 9/15/2015 
Target
Name:
Cyclin-dependent kinase 9
Synonyms:
C-2K CDK9 Cell division cycle 2-like protein kinase 4 Cyclin-Dependent Kinase 9 (CDK9) Serine/threonine-protein kinase PITALRE Tat-associated kinase complex catalytic subunit
Type:
Enzyme Subunit
Mol. Mass.:
42789.13
Organism:
Homo sapiens (Human)
Description:
Residue:
372
  
Inhibitor
Name:
BDBM180850
Synonyms:
US9133171, 55
Type:
Small organic molecule
Emp. Form.:
C25H21F3N4O2S
Mol. Mass.:
498.52
SMILES:
CS(=N)(=O)Cc1cccc(Nc2ncc(F)c(n2)-c2ccc(F)cc2OCc2ccc(F)cc2)c1
: