Target
Dual specificity protein kinase CLK1
Ligand
BDBM181050
Substrate
Meas. Tech.
Kinase Inhibition Assay
IC50
51±0.0 nM
Citation
 Prak, KKriston-Vizi, JChan, AWLuft, CCosta, JRPengo, NKetteler, R Benzobisthiazoles Represent a Novel Scaffold for Kinase Inhibitors of CLK Family Members. Biochemistry 55:608-17 (2016)  
Target
Name:
Dual specificity protein kinase CLK1
Synonyms:
CDC-like kinase 1 CDC2-like kinase 1 (CLK1) CLK1 Dual specificity protein kinase CLK1 Dual specificty protein kinase CLK1
Type:
Protein
Mol. Mass.:
57322.21
Organism:
Homo sapiens (Human)
Description:
P49759
Residue:
484
  
Inhibitor
Name:
BDBM181050
Synonyms:
3A5
Type:
Small organic molecule
Emp. Form.:
C17H10N4OS3
Mol. Mass.:
382.482
SMILES:
Cc1nc2ccc3sc(NC(=O)c4ccc5ncsc5c4)nc3c2s1
: