Target
Dual specificity protein kinase CLK2
Ligand
BDBM181051
Substrate
Meas. Tech.
Kinase Inhibition Assay
IC50
174±0.0 nM
Citation
 Prak, KKriston-Vizi, JChan, AWLuft, CCosta, JRPengo, NKetteler, R Benzobisthiazoles Represent a Novel Scaffold for Kinase Inhibitors of CLK Family Members. Biochemistry 55:608-17 (2016)  
Target
Name:
Dual specificity protein kinase CLK2
Synonyms:
2.7.12.1 CDC-like kinase 2 (CLK2) CLK2 | CLK2_HUMAN
Type:
Mol. Mass.:
60128.79
Organism:
Homo sapiens (Human)
Description:
P49760
Residue:
499
  
Inhibitor
Name:
BDBM181051
Synonyms:
5E4
Type:
Small organic molecule
Emp. Form.:
C14H9N3O2S3
Mol. Mass.:
347.435
SMILES:
CSc1nc2ccc3nc(NC(=O)c4ccco4)sc3c2s1
: