Target
Cytochrome P450 3A4
Ligand
BDBM50015234
Substrate
Meas. Tech.
IC50
>10000±n/a nM
Citation
 Bareja, SPJones, SDOblong, JEMills, KJBierman, JC Cosmetic compositions containing substituted azole and methods for improving the appearance of aging skin US Patent  US9138393 Publication Date 9/22/2015 
Target
Name:
Cytochrome P450 3A4
Synonyms:
Albendazole monooxygenase CP3A4_HUMAN CYP3A4 CYPIIIA4 Cytochrome P450 3A4 (CYP3A4) Nifedipine oxidase Taurochenodeoxycholate 6-alpha-hydroxylase
Type:
Enzyme
Mol. Mass.:
57349.57
Organism:
Homo sapiens (Human)
Description:
Residue:
503
  
Inhibitor
Name:
BDBM50015234
Synonyms:
4,4''[1,6-HEXANEDIYLBIS(OXY)]BISBENZENECARBOXIMIDAMIDE 4-{6-[4-amino(imino)methylphenoxy]hexyloxy}phenyl-iminomethanamine CHEMBL25105 US9138393, Hexamidine diisethionate | US9144538, Hexamidine diisethionate
Type:
Small organic molecule
Emp. Form.:
C20H26N4O2
Mol. Mass.:
354.446
SMILES:
NC(=N)c1ccc(OCCCCCCOc2ccc(cc2)C(N)=N)cc1
: