Target
Sodium channel protein type 10 subunit alpha
Ligand
BDBM181165
Substrate
Meas. Tech.
Electrophysiology Assay
IC50
6±n/a nM
Citation
 Hadida-Ruah, SSAnderson, CArumugam, VAsgian, ILBear, BRTermin, APJohnson, JP Substituted quinoxalines as sodium channel modulators US Patent  US9139529 Publication Date 9/22/2015 
Target
Name:
Sodium channel protein type 10 subunit alpha
Synonyms:
SCNAA_RAT Sns Sodium channel protein type X alpha subunit | Voltage-gated sodium channel subunit alpha Nav1.8
Type:
Enzyme
Mol. Mass.:
219724.17
Organism:
Rattus norvegicus (Rat)
Description:
Q62968
Residue:
1956
  
Inhibitor
Name:
BDBM181165
Synonyms:
US9139529, 8 | US9783501, Compound 8
Type:
Small organic molecule
Emp. Form.:
C23H20N4O6S
Mol. Mass.:
480.493
SMILES:
COc1ccc(Oc2nc3ccccc3nc2C(=O)Nc2cccc(c2)S(N)(=O)=O)c(OC)c1
: