Target
Sodium channel protein type 10 subunit alpha
Ligand
BDBM181178
Substrate
Meas. Tech.
Electrophysiology Assay
IC50
235±n/a nM
Citation
 Hadida-Ruah, SSAnderson, CArumugam, VAsgian, ILBear, BRTermin, APJohnson, JP Substituted quinoxalines as sodium channel modulators US Patent  US9139529 Publication Date 9/22/2015 
Target
Name:
Sodium channel protein type 10 subunit alpha
Synonyms:
SCNAA_RAT Sns Sodium channel protein type X alpha subunit | Voltage-gated sodium channel subunit alpha Nav1.8
Type:
Enzyme
Mol. Mass.:
219724.17
Organism:
Rattus norvegicus (Rat)
Description:
Q62968
Residue:
1956
  
Inhibitor
Name:
BDBM181178
Synonyms:
US9139529, 21 | US9783501, Compound 21
Type:
Small organic molecule
Emp. Form.:
C22H15FN4O5
Mol. Mass.:
434.3767
SMILES:
COc1ccc(Oc2nc3ccccc3nc2C(=O)Nc2ccc(nc2)C(O)=O)c(F)c1
: