Target
MAP kinase-interacting serine/threonine-protein kinase 2
Ligand
BDBM181444
Substrate
Meas. Tech.
In vitro Kinase Assay
IC50
1±n/a nM
Citation
 Blum, AGottschling, DHeckel, AHehn, JPSchmid, BWiedenmayer, D Sulfoximine substituted quinazolines for pharmaceutical compositions US Patent  US9139577 Publication Date 9/22/2015 
Target
Name:
MAP kinase-interacting serine/threonine-protein kinase 2
Synonyms:
GPRK7 MAP kinase-interacting serine/threonine-protein kinase 2 (MKNK2) MAP-kinase interacting kinase 2 (MNK2) MKNK2_HUMAN | MNK2
Type:
Protein
Mol. Mass.:
51870.79
Organism:
Homo sapiens (Human)
Description:
Q9HBH9
Residue:
465
  
Inhibitor
Name:
BDBM181444
Synonyms:
US9139577, 3.005 | US9708274, 3.005
Type:
Small organic molecule
Emp. Form.:
C19H18FN5O2S
Mol. Mass.:
399.442
SMILES:
Cc1cc(cc2ncnc(Nc3ccc(F)cc3OCC#N)c12)N=S(C)(C)=O
: