Target
MAP kinase-interacting serine/threonine-protein kinase 2
Ligand
BDBM181608
Substrate
Meas. Tech.
In vitro Kinase Assay
IC50
5±n/a nM
Citation
 Blum, AGottschling, DHeckel, AHehn, JPSchmid, BWiedenmayer, D Sulfoximine substituted quinazolines for pharmaceutical compositions US Patent  US9139577 Publication Date 9/22/2015 
Target
Name:
MAP kinase-interacting serine/threonine-protein kinase 2
Synonyms:
GPRK7 MAP kinase-interacting serine/threonine-protein kinase 2 (MKNK2) MAP-kinase interacting kinase 2 (MNK2) MKNK2_HUMAN | MNK2
Type:
Protein
Mol. Mass.:
51870.79
Organism:
Homo sapiens (Human)
Description:
Q9HBH9
Residue:
465
  
Inhibitor
Name:
BDBM181608
Synonyms:
US9139577, 4.114 | US9708274, 4.114
Type:
Small organic molecule
Emp. Form.:
C23H25F2N5O3S
Mol. Mass.:
489.538
SMILES:
CC(C)NC(=O)[C@@H](C)Oc1cc(F)ccc1Nc1ncnc2cc(cc(F)c12)N=S1(=O)CCC1
: