Target
MAP kinase-interacting serine/threonine-protein kinase 1
Ligand
BDBM181630
Substrate
Meas. Tech.
In vitro Kinase Assay
IC50
29±n/a nM
Citation
 Blum, AGottschling, DHeckel, AHehn, JPSchmid, BWiedenmayer, D Sulfoximine substituted quinazolines for pharmaceutical compositions US Patent  US9139577 Publication Date 9/22/2015 
Target
Name:
MAP kinase-interacting serine/threonine-protein kinase 1
Synonyms:
MAP Kinase-Interacting Protein Kinase (MNK1) MAP kinase-interacting serine/threonine-protein kinase 1 (MnK1) MAP-kinase interacting kinase 1 (MNK1) MKNK1 MNK1
Type:
Serine/threonine-protein kinase
Mol. Mass.:
51342.85
Organism:
Homo sapiens (Human)
Description:
Q9BUB5
Residue:
465
  
Inhibitor
Name:
BDBM181630
Synonyms:
US9139577, 4.136
Type:
Small organic molecule
Emp. Form.:
C23H22F5N5O3S
Mol. Mass.:
543.509
SMILES:
C[C@@H](Oc1cc(F)ccc1Nc1ncnc2cc(cc(F)c12)N=S1(=O)CCC1)C(=O)N[C@@H](C)C(F)(F)F
: