Target
MAP kinase-interacting serine/threonine-protein kinase 1
Ligand
BDBM181645
Substrate
Meas. Tech.
In vitro Kinase Assay
IC50
66±n/a nM
Citation
 Blum, AGottschling, DHeckel, AHehn, JPSchmid, BWiedenmayer, D Sulfoximine substituted quinazolines for pharmaceutical compositions US Patent  US9139577 Publication Date 9/22/2015 
Target
Name:
MAP kinase-interacting serine/threonine-protein kinase 1
Synonyms:
MAP Kinase-Interacting Protein Kinase (MNK1) MAP kinase-interacting serine/threonine-protein kinase 1 (MnK1) MAP-kinase interacting kinase 1 (MNK1) MKNK1 MNK1
Type:
Serine/threonine-protein kinase
Mol. Mass.:
51342.85
Organism:
Homo sapiens (Human)
Description:
Q9BUB5
Residue:
465
  
Inhibitor
Name:
BDBM181645
Synonyms:
US9139577, 5.004 | US9708274, 5.004
Type:
Small organic molecule
Emp. Form.:
C22H23F4N5O3S
Mol. Mass.:
513.508
SMILES:
C[C@@H](CNC(=O)C(F)(F)F)Oc1cc(F)ccc1Nc1ncnc2cc(cc(C)c12)N=S(C)(C)=O
: