Target
ATP-sensitive inward rectifier potassium channel 1
Ligand
BDBM181727
Substrate
Meas. Tech.
Electrophysiology Assay
pH
7.4±n/a
Temperature
310.15±n/a K
IC50
32±n/a nM
Comments
extracted
Citation
 Walsh, SPPasternak, ADeJesus, RKTang, HPio, BShahripour, ABelyk, KMChobanian, HRGuo, YFrie, JLShi, ZChen, HBlizzard, TACato, B Inhibitors of the Renal Outer Medullary Potassium channel US Patent  US9139585 Publication Date 9/22/2015 
Target
Name:
ATP-sensitive inward rectifier potassium channel 1
Synonyms:
ATP-regulated potassium channel ROM-K ATP-sensitive inward rectifier potassium channel 1 KCNJ1 Potassium channel (ATP modulatory) ROMK1 The Renal Outer Medullary Potassium (ROMK)
Type:
Enzyme Catalytic Domain
Mol. Mass.:
44809.08
Organism:
Homo sapiens (Human)
Description:
gi_223460826
Residue:
391
  
Inhibitor
Name:
BDBM181727
Synonyms:
US9139585, 22
Type:
Small organic molecule
Emp. Form.:
C29H34N2O6
Mol. Mass.:
506.5901
SMILES:
C[C@H]1Cc2cc(CCN3CC4COCC(C3)N4C[C@H](O)c3ccc4C(=O)OCc4c3C)ccc2C(=O)O1
: