Target
ATP-sensitive inward rectifier potassium channel 1
Ligand
BDBM181737
Substrate
Meas. Tech.
Electrophysiology Assay
pH
7.4±n/a
Temperature
310.15±n/a K
IC50
21±n/a nM
Comments
extracted
Citation
 Walsh, SPPasternak, ADeJesus, RKTang, HPio, BShahripour, ABelyk, KMChobanian, HRGuo, YFrie, JLShi, ZChen, HBlizzard, TACato, B Inhibitors of the Renal Outer Medullary Potassium channel US Patent  US9139585 Publication Date 9/22/2015 
Target
Name:
ATP-sensitive inward rectifier potassium channel 1
Synonyms:
ATP-regulated potassium channel ROM-K ATP-sensitive inward rectifier potassium channel 1 KCNJ1 Potassium channel (ATP modulatory) ROMK1 The Renal Outer Medullary Potassium (ROMK)
Type:
Enzyme Catalytic Domain
Mol. Mass.:
44809.08
Organism:
Homo sapiens (Human)
Description:
gi_223460826
Residue:
391
  
Inhibitor
Name:
BDBM181737
Synonyms:
US9139585, 30
Type:
Small organic molecule
Emp. Form.:
C26H30N2O5
Mol. Mass.:
450.5268
SMILES:
Cc1c2COC(=O)c2ccc1[C@@H](O)CN1CCN(CCc2ccc3C(=O)OCCc3c2)CC1
: