Target
Tyrosine-protein kinase SYK
Ligand
BDBM182180
Substrate
Meas. Tech.
Homogeneous Time-Resolved Fluorescence (HTRF) Assay
pH
7.5±n/a
Temperature
298.15±n/a K
IC50
1±n/a nM
Comments
extracted
Citation
 Deschenes, DAltman, MDEllis, JMFischer, CHaidle, AMKattar, SDNorthrup, ABSchell, AJSmith, GFTaoka, BMBienstock, CDi Francesco, MEDonofrio, APeterson, SSpencer, KBJewell, JPAli, ABennett, DJDang, QWai, J Bipyridylaminopyridines as Syk inhibitors US Patent  US9145391 Publication Date 9/29/2015 
Target
Name:
Tyrosine-protein kinase SYK
Synonyms:
KSYK_HUMAN Spleen Tyrosine Kinase Tyrosine-protein kinase SYK (Syk)
Type:
Enzyme
Mol. Mass.:
72079.99
Organism:
Homo sapiens (Human)
Description:
P43405
Residue:
635
  
Inhibitor
Name:
BDBM182180
Synonyms:
US9145391, 4-77
Type:
Small organic molecule
Emp. Form.:
C29H28F3N7O
Mol. Mass.:
547.5741
SMILES:
Cc1cc(Nc2cc(ccn2)C(F)(F)F)nc(c1)-c1ccc(NC2CCN(CC2)C(=O)Cc2cccnc2)nc1
: