Target
Tyrosine-protein kinase SYK
Ligand
BDBM182243
Substrate
Meas. Tech.
Homogeneous Time-Resolved Fluorescence (HTRF) Assay
pH
7.5±n/a
Temperature
298.15±n/a K
IC50
1±n/a nM
Comments
extracted
Citation
 Deschenes, DAltman, MDEllis, JMFischer, CHaidle, AMKattar, SDNorthrup, ABSchell, AJSmith, GFTaoka, BMBienstock, CDi Francesco, MEDonofrio, APeterson, SSpencer, KBJewell, JPAli, ABennett, DJDang, QWai, J Bipyridylaminopyridines as Syk inhibitors US Patent  US9145391 Publication Date 9/29/2015 
Target
Name:
Tyrosine-protein kinase SYK
Synonyms:
KSYK_HUMAN Spleen Tyrosine Kinase Tyrosine-protein kinase SYK (Syk)
Type:
Enzyme
Mol. Mass.:
72079.99
Organism:
Homo sapiens (Human)
Description:
P43405
Residue:
635
  
Inhibitor
Name:
BDBM182243
Synonyms:
US9145391, 15
Type:
Small organic molecule
Emp. Form.:
C26H27BrF2N4O3
Mol. Mass.:
561.418
SMILES:
Cc1cc(Nc2cc(ccn2)C(F)F)nc(-c2ccc(nc2)C(C)(O)[C@H]2CC[C@@H](CC2)C(O)=O)c1Br
: