Target
Ribosomal protein S6 kinase beta-1
Ligand
BDBM182451
Substrate
Meas. Tech.
P70S6K Enzyme Assay
pH
7.5±n/a
Temperature
298.15±n/a K
IC50
5.2±n/a nM
Comments
extracted
Citation
 Lan, RHuck, BRXiao, YChen, XDeselm, LCQiu, HNeagu, CBankston, DJones, CC Imidazole amines as modulators of kinase activity US Patent  US9145392 Publication Date 9/29/2015 
Target
Name:
Ribosomal protein S6 kinase beta-1
Synonyms:
70 kDa ribosomal protein S6 kinase 1 70 kDa ribosomal protein kinase (p70S6K) Protein kinase 70S6K (T412E) RPS6KB1 Ribosomal protein S6 kinase I STK14A p70S6K1
Type:
Enzyme
Mol. Mass.:
59139.89
Organism:
Homo sapiens (Human)
Description:
His-tagged S6K1.
Residue:
525
  
Inhibitor
Name:
BDBM182451
Synonyms:
US9145392, 152
Type:
Small organic molecule
Emp. Form.:
C25H29F4N7
Mol. Mass.:
503.5383
SMILES:
CCc1c(N)ncnc1N1CCC(CC1)c1nc(cn1CC1CCN1)-c1ccc(F)c(c1)C(F)(F)F
: